Target
Estrogen receptor
Ligand
BDBM40047
Substrate
Meas. Tech.
Estrogen Receptor (alpha) binding: Dose Response of Primary Screen Assay
EC50
9.68±n/a nM
Citation
 PubChem, PC Estrogen Receptor (alpha) binding: Dose Response of Primary Screen Assay PubChem Bioassay (2008)[AID] 
Target
Name:
Estrogen receptor
Synonyms:
ER ESR ESR1_HUMAN Estrogen receptor Estrogen receptor (ER-alpha) Estrogen receptor alpha (ER) Nuclear receptor subfamily 3 group A member 1
Type:
Protein
Mol. Mass.:
66230.44
Organism:
Homo sapiens (Human)
Description:
P03372
Residue:
595
  
Inhibitor
Name:
BDBM40047
Synonyms:
MLS000087249 N-[(4-methoxyphenyl)methyl]-5-thiophen-2-yl-1,2-oxazole-3-carboxamide N-p-anisyl-5-(2-thienyl)isoxazole-3-carboxamide cid_3243936
Type:
Small organic molecule
Emp. Form.:
C16H14N2O3S
Mol. Mass.:
314.359
SMILES:
COc1ccc(CNC(=O)c2cc(on2)-c2cccs2)cc1
: