Target
Estrogen receptor
Ligand
BDBM40544
Substrate
Meas. Tech.
Estrogen Receptor (alpha) binding: Dose Response of Primary Screen Assay
EC50
36.6±n/a nM
Citation
 PubChem, PC Estrogen Receptor (alpha) binding: Dose Response of Primary Screen Assay PubChem Bioassay (2008)[AID] 
Target
Name:
Estrogen receptor
Synonyms:
ER ESR ESR1_HUMAN Estrogen receptor Estrogen receptor (ER-alpha) Estrogen receptor alpha (ER) Nuclear receptor subfamily 3 group A member 1
Type:
Protein
Mol. Mass.:
66230.44
Organism:
Homo sapiens (Human)
Description:
P03372
Residue:
595
  
Inhibitor
Name:
BDBM40544
Synonyms:
(6S,8R,9S,13S,14S,17S)-13-methyl-6,7,8,9,11,12,14,15,16,17-decahydrocyclopenta[a]phenanthrene-3,6,17-triol MLS000028696 cid_5284655
Type:
Small organic molecule
Emp. Form.:
C18H24O3
Mol. Mass.:
288.3814
SMILES:
C[C@]12CC[C@H]3[C@@H](C[C@H](O)c4cc(O)ccc34)[C@@H]1CC[C@@H]2O
: