Target
Galanin receptor type 2
Ligand
BDBM42040
Substrate
Meas. Tech.
Dose Response cell-based high-throughput screening assay to identify antagonists of galanin receptor 2 (GALR2)
IC50
>42000±n/a nM
Citation
 PubChem, PC Dose Response cell-based high-throughput screening assay to identify antagonists of galanin receptor 2 (GALR2) PubChem Bioassay (2008)[AID] 
Target
Name:
Galanin receptor type 2
Synonyms:
GALNR2 GALR2_HUMAN Galanin receptor 2 Galanin receptor type 2 (GAL2-R) (GALR2).
Type:
Enzyme Catalytic Domain
Mol. Mass.:
41724.40
Organism:
Homo sapiens (Human)
Description:
Galanin R2 GALR2 HUMAN::O43603
Residue:
387
  
Inhibitor
Name:
BDBM42040
Synonyms:
2-[4-(4-pyridylmethylsulfamoyl)phenoxy]acetic acid ethyl ester MLS000096632 cid_1082996 ethyl 2-[4-(pyridin-4-ylmethylsulfamoyl)phenoxy]acetate | ethyl 2-[4-(pyridin-4-ylmethylsulfamoyl)phenoxy]ethanoate
Type:
Small organic molecule
Emp. Form.:
C16H18N2O5S
Mol. Mass.:
350.39
SMILES:
CCOC(=O)COc1ccc(cc1)S(=O)(=O)NCc1ccncc1
: