Target
Galanin receptor type 2
Ligand
BDBM38870
Substrate
Meas. Tech.
Dose Response cell-based high-throughput screening assay to identify antagonists of galanin receptor 2 (GALR2)
IC50
>42000±n/a nM
Citation
 PubChem, PC Dose Response cell-based high-throughput screening assay to identify antagonists of galanin receptor 2 (GALR2) PubChem Bioassay (2008)[AID] 
Target
Name:
Galanin receptor type 2
Synonyms:
GALNR2 GALR2_HUMAN Galanin receptor 2 Galanin receptor type 2 (GAL2-R) (GALR2).
Type:
Enzyme Catalytic Domain
Mol. Mass.:
41724.40
Organism:
Homo sapiens (Human)
Description:
Galanin R2 GALR2 HUMAN::O43603
Residue:
387
  
Inhibitor
Name:
BDBM38870
Synonyms:
(7S,12R,15S)-12,15-dihydroxy-7-methyl-8-oxabicyclo[11.3.0]hexadeca-2,10-dien-9-one BREFELDIN A SMR000058539 | cid_657314
Type:
Small organic molecule
Emp. Form.:
C16H24O4
Mol. Mass.:
280.3594
SMILES:
C[C@H]1CCCC=CC2C[C@H](O)CC2[C@H](O)C=CC(=O)O1
: