Target
Galanin receptor type 2
Ligand
BDBM42064
Substrate
Meas. Tech.
Dose Response cell-based high-throughput screening assay to identify antagonists of galanin receptor 2 (GALR2)
IC50
>42000±n/a nM
Citation
 PubChem, PC Dose Response cell-based high-throughput screening assay to identify antagonists of galanin receptor 2 (GALR2) PubChem Bioassay (2008)[AID] 
Target
Name:
Galanin receptor type 2
Synonyms:
GALNR2 GALR2_HUMAN Galanin receptor 2 Galanin receptor type 2 (GAL2-R) (GALR2).
Type:
Enzyme Catalytic Domain
Mol. Mass.:
41724.40
Organism:
Homo sapiens (Human)
Description:
Galanin R2 GALR2 HUMAN::O43603
Residue:
387
  
Inhibitor
Name:
BDBM42064
Synonyms:
1-[1-(2-chlorophenyl)-2-keto-cyclohexyl]-3-cyclohexyl-1-methyl-thiourea 1-[1-(2-chlorophenyl)-2-oxocyclohexyl]-3-cyclohexyl-1-methylthiourea SMR000260093 | cid_4006073
Type:
Small organic molecule
Emp. Form.:
C20H27ClN2OS
Mol. Mass.:
378.959
SMILES:
CN(C(=S)NC1CCCCC1)C1(CCCCC1=O)c1ccccc1Cl
: