Target
Glyceraldehyde-3-phosphate dehydrogenase
Ligand
BDBM31741
Substrate
Meas. Tech.
GAPDH Dose Response Colorimetric Assay
IC50
87300±8740 nM
Citation
 PubChem, PC GAPDH Dose Response Colorimetric Assay PubChem Bioassay (2008)[AID] 
Target
Name:
Glyceraldehyde-3-phosphate dehydrogenase
Synonyms:
G3P_HUMAN GAPDH glyceraldehyde-3-phosphate dehydrogenase
Type:
PROTEIN
Mol. Mass.:
36060.86
Organism:
Homo sapiens (Human)
Description:
ChEMBL_1511315
Residue:
335
  
Inhibitor
Name:
BDBM31741
Synonyms:
8-(2-methylpropoxycarbonyl)-3a,4,5,9b-tetrahydro-3H-cyclopenta[c]quinoline-4-carboxylic acid 8-isobutoxycarbonyl-3a,4,5,9b-tetrahydro-3H-cyclopenta[c]quinoline-4-carboxylic acid cid_2920908
Type:
Small organic molecule
Emp. Form.:
C18H21NO4
Mol. Mass.:
315.3636
SMILES:
CC(C)COC(=O)c1ccc2NC(C3CC=CC3c2c1)C(O)=O
: