Target
Glyceraldehyde-3-phosphate dehydrogenase
Ligand
BDBM42075
Substrate
Meas. Tech.
GAPDH Dose Response Colorimetric Assay
IC50
81200±22200 nM
Citation
 PubChem, PC GAPDH Dose Response Colorimetric Assay PubChem Bioassay (2008)[AID] 
Target
Name:
Glyceraldehyde-3-phosphate dehydrogenase
Synonyms:
G3P_HUMAN GAPDH glyceraldehyde-3-phosphate dehydrogenase
Type:
PROTEIN
Mol. Mass.:
36060.86
Organism:
Homo sapiens (Human)
Description:
ChEMBL_1511315
Residue:
335
  
Inhibitor
Name:
BDBM42075
Synonyms:
2-[5-(4-methoxyphenyl)-3-phenyl-1H-pyrazol-4-yl]-1H-benzimidazole cid_2303842
Type:
Small organic molecule
Emp. Form.:
C23H18N4O
Mol. Mass.:
366.4152
SMILES:
COc1ccc(cc1)-c1[nH]nc(c1-c1nc2ccccc2[nH]1)-c1ccccc1
: