Target
Galanin receptor type 2
Ligand
BDBM42043
Substrate
Meas. Tech.
Dose response counterscreen for antagonists of galanin receptor 2 (GalR2): a cell-based high-throughput screening assay for inhibitors of beta-lactamase activity
IC50
>42000±n/a nM
Citation
 PubChem, PC Dose response counterscreen for antagonists of galanin receptor 2 (GalR2): a cell-based high-throughput screening assay for inhibitors of beta-lactamase activity PubChem Bioassay (2008)[AID] 
Target
Name:
Galanin receptor type 2
Synonyms:
GALNR2 GALR2_HUMAN Galanin receptor 2 Galanin receptor type 2 (GAL2-R) (GALR2).
Type:
Enzyme Catalytic Domain
Mol. Mass.:
41724.40
Organism:
Homo sapiens (Human)
Description:
Galanin R2 GALR2 HUMAN::O43603
Residue:
387
  
Inhibitor
Name:
BDBM42043
Synonyms:
Adamantane-1-carboxylic acid (2-pyridin-3-yl-1H-benzoimidazol-5-yl)-amide N-(2-pyridin-3-yl-3H-benzimidazol-5-yl)adamantane-1-carboxamide N-[2-(3-pyridyl)-3H-benzimidazol-5-yl]adamantane-1-carboxamide cid_3147250
Type:
Small organic molecule
Emp. Form.:
C23H24N4O
Mol. Mass.:
372.4629
SMILES:
[H]C12CC3([H])CC([H])(C1)CC(C2)(C3)C(=O)Nc1ccc2nc([nH]c2c1)-c1cccnc1
: