Target
Galanin receptor type 2
Ligand
BDBM42050
Substrate
Meas. Tech.
Dose response counterscreen for antagonists of galanin receptor 2 (GalR2): a cell-based high-throughput screening assay for inhibitors of beta-lactamase activity
IC50
>42000±n/a nM
Citation
 PubChem, PC Dose response counterscreen for antagonists of galanin receptor 2 (GalR2): a cell-based high-throughput screening assay for inhibitors of beta-lactamase activity PubChem Bioassay (2008)[AID] 
Target
Name:
Galanin receptor type 2
Synonyms:
GALNR2 GALR2_HUMAN Galanin receptor 2 Galanin receptor type 2 (GAL2-R) (GALR2).
Type:
Enzyme Catalytic Domain
Mol. Mass.:
41724.40
Organism:
Homo sapiens (Human)
Description:
Galanin R2 GALR2 HUMAN::O43603
Residue:
387
  
Inhibitor
Name:
BDBM42050
Synonyms:
1-(tosylmethyl)-1,2-dihydrothiazolo[3,2-a]benzimidazole 1-[(4-methylphenyl)sulfonylmethyl]-1,2-dihydrothiazolo[3,2-a]benzimidazole MLS000558294 cid_2955782
Type:
Small organic molecule
Emp. Form.:
C17H16N2O2S2
Mol. Mass.:
344.451
SMILES:
Cc1ccc(cc1)S(=O)(=O)CC1CSc2nc3ccccc3n12
: