Target
Galanin receptor type 2
Ligand
BDBM42051
Substrate
Meas. Tech.
Dose response counterscreen for antagonists of galanin receptor 2 (GalR2): a cell-based high-throughput screening assay for inhibitors of beta-lactamase activity
IC50
16970±n/a nM
Citation
 PubChem, PC Dose response counterscreen for antagonists of galanin receptor 2 (GalR2): a cell-based high-throughput screening assay for inhibitors of beta-lactamase activity PubChem Bioassay (2008)[AID] 
Target
Name:
Galanin receptor type 2
Synonyms:
GALNR2 GALR2_HUMAN Galanin receptor 2 Galanin receptor type 2 (GAL2-R) (GALR2).
Type:
Enzyme Catalytic Domain
Mol. Mass.:
41724.40
Organism:
Homo sapiens (Human)
Description:
Galanin R2 GALR2 HUMAN::O43603
Residue:
387
  
Inhibitor
Name:
BDBM42051
Synonyms:
(E)-1-(4-chlorophenyl)-3-(1H-1,2,4-triazol-5-ylsulfanyl)prop-2-en-1-one (E)-1-(4-chlorophenyl)-3-(1H-1,2,4-triazol-5-ylthio)prop-2-en-1-one MLS000325768 cid_1478923
Type:
Small organic molecule
Emp. Form.:
C11H8ClN3OS
Mol. Mass.:
265.719
SMILES:
Clc1ccc(cc1)C(=O)C=CSc1nnc[nH]1
: