Target
Galanin receptor type 2
Ligand
BDBM42059
Substrate
Meas. Tech.
Dose response counterscreen for antagonists of galanin receptor 2 (GalR2): a cell-based high-throughput screening assay for inhibitors of beta-lactamase activity
IC50
>42000±n/a nM
Citation
 PubChem, PC Dose response counterscreen for antagonists of galanin receptor 2 (GalR2): a cell-based high-throughput screening assay for inhibitors of beta-lactamase activity PubChem Bioassay (2008)[AID] 
Target
Name:
Galanin receptor type 2
Synonyms:
GALNR2 GALR2_HUMAN Galanin receptor 2 Galanin receptor type 2 (GAL2-R) (GALR2).
Type:
Enzyme Catalytic Domain
Mol. Mass.:
41724.40
Organism:
Homo sapiens (Human)
Description:
Galanin R2 GALR2 HUMAN::O43603
Residue:
387
  
Inhibitor
Name:
BDBM42059
Synonyms:
MLS000391275 N-[(Z)-(3-aminoisoindol-1-ylidene)amino]-4-(4-fluorophenyl)-1,3-thiazol-2-amine SMR000260312 cid_6261459
Type:
Small organic molecule
Emp. Form.:
C17H12FN5S
Mol. Mass.:
337.374
SMILES:
NC1=NC(=NNc2nc(cs2)-c2ccc(F)cc2)c2ccccc12
: