Target
Galanin receptor type 2
Ligand
BDBM42068
Substrate
Meas. Tech.
Dose response counterscreen for antagonists of galanin receptor 2 (GalR2): a cell-based high-throughput screening assay for inhibitors of beta-lactamase activity
IC50
>42000±n/a nM
Citation
 PubChem, PC Dose response counterscreen for antagonists of galanin receptor 2 (GalR2): a cell-based high-throughput screening assay for inhibitors of beta-lactamase activity PubChem Bioassay (2008)[AID] 
Target
Name:
Galanin receptor type 2
Synonyms:
GALNR2 GALR2_HUMAN Galanin receptor 2 Galanin receptor type 2 (GAL2-R) (GALR2).
Type:
Enzyme Catalytic Domain
Mol. Mass.:
41724.40
Organism:
Homo sapiens (Human)
Description:
Galanin R2 GALR2 HUMAN::O43603
Residue:
387
  
Inhibitor
Name:
BDBM42068
Synonyms:
4-acetyl-3,5-dimethyl-1H-pyrrole-2-carboxylic acid [2-(4-chloro-2-nitro-anilino)-2-keto-ethyl] ester MLS000389072 [2-(4-chloro-2-nitroanilino)-2-oxoethyl] 4-acetyl-3,5-dimethyl-1H-pyrrole-2-carboxylate cid_4350340
Type:
Small organic molecule
Emp. Form.:
C17H16ClN3O6
Mol. Mass.:
393.778
SMILES:
CC(=O)c1c(C)[nH]c(C(=O)OCC(=O)Nc2ccc(Cl)cc2[N+]([O-])=O)c1C
: