Target
Nuclear receptor subfamily 4 group A member 1
Ligand
BDBM50312873
Substrate
Meas. Tech.
Fluorescence Polarization Dose Response Assay for TR3-Based Bcl-B Inhibitors
EC50
3690±3830 nM
Citation
 PubChem, PC Fluorescence Polarization Dose Response Assay for TR3-Based Bcl-B Inhibitors PubChem Bioassay (2008)[AID] 
Target
Name:
Nuclear receptor subfamily 4 group A member 1
Synonyms:
GFRP1 NAK1 NR4A1_HUMAN | nuclear receptor subfamily 4, group A, member 1
Type:
Enzyme Catalytic Domain
Mol. Mass.:
64467.13
Organism:
Homo sapiens (Human)
Description:
gi_27894344
Residue:
598
  
Inhibitor
Name:
BDBM50312873
Synonyms:
4-(4-(pyridin-2-yl)thiazol-2-ylamino)phenol CHEMBL579212 | cid_704363
Type:
Small organic molecule
Emp. Form.:
C14H11N3OS
Mol. Mass.:
269.322
SMILES:
Oc1ccc(Nc2nc(cs2)-c2ccccn2)cc1
: