Target
Nuclear receptor subfamily 4 group A member 1
Ligand
BDBM42117
Substrate
Meas. Tech.
Fluorescence Polarization Dose Response Assay for TR3-Based Bcl-B Inhibitors
EC50
620±220 nM
Citation
 PubChem, PC Fluorescence Polarization Dose Response Assay for TR3-Based Bcl-B Inhibitors PubChem Bioassay (2008)[AID] 
Target
Name:
Nuclear receptor subfamily 4 group A member 1
Synonyms:
GFRP1 NAK1 NR4A1_HUMAN | nuclear receptor subfamily 4, group A, member 1
Type:
Enzyme Catalytic Domain
Mol. Mass.:
64467.13
Organism:
Homo sapiens (Human)
Description:
gi_27894344
Residue:
598
  
Inhibitor
Name:
BDBM42117
Synonyms:
2-(2,5-dimethyl-1-pyrrolyl)benzoic acid BIM-0048144.P001 | cid_292956
Type:
Small organic molecule
Emp. Form.:
C13H13NO2
Mol. Mass.:
215.2478
SMILES:
Cc1ccc(C)n1-c1ccccc1C(O)=O
: