Target
Nuclear receptor subfamily 4 group A member 1
Ligand
BDBM42121
Substrate
Meas. Tech.
Fluorescence Polarization Dose Response Assay for TR3-Based Bcl-B Inhibitors
EC50
20690±35810 nM
Citation
 PubChem, PC Fluorescence Polarization Dose Response Assay for TR3-Based Bcl-B Inhibitors PubChem Bioassay (2008)[AID] 
Target
Name:
Nuclear receptor subfamily 4 group A member 1
Synonyms:
GFRP1 NAK1 NR4A1_HUMAN | nuclear receptor subfamily 4, group A, member 1
Type:
Enzyme Catalytic Domain
Mol. Mass.:
64467.13
Organism:
Homo sapiens (Human)
Description:
gi_27894344
Residue:
598
  
Inhibitor
Name:
BDBM42121
Synonyms:
6-iodanyl-8-methyl-3a,4,5,9b-tetrahydro-3H-cyclopenta[c]quinoline-4-carboxylic acid BIM-0042382.P001 | cid_5347022
Type:
Small organic molecule
Emp. Form.:
C14H14INO2
Mol. Mass.:
355.1709
SMILES:
Cc1cc(I)c2NC(C3CC=CC3c2c1)C(O)=O
: