Target
UDP-3-O-acyl-N-acetylglucosamine deacetylase
Ligand
BDBM265014
Substrate
Meas. Tech.
P. aeruqinosa LpxC Inhibition Assay
pH
7.5±n/a
Temperature
298.15±n/a K
IC50
<0.001±n/a nM
Comments
extracted
Citation
 Fu, JJin, XKarur, SLaPointe, GLee, PSweeney, ZK Isoxazoline hydroxamic acid derivatives as LpxC inhibitors US Patent  US9718792 Publication Date 8/1/2017 
Target
Name:
UDP-3-O-acyl-N-acetylglucosamine deacetylase
Synonyms:
LPXC_PSEAE UDP-3-O-[3-hydroxymyristoyl] N-acetylglucosamine deacetylase UDP-3-O-[3-hydroxymyristoyl] N-acetylglucosamine deacetylase (LpxC) UDP-3-O-acyl-GlcNAc deacetylase (LpxC) lpxC
Type:
Enzyme
Mol. Mass.:
33428.15
Organism:
Pseudomonas aeruginosa
Description:
P47205
Residue:
303
  
Inhibitor
Name:
BDBM265014
Synonyms:
US9718792, 119
Type:
Small organic molecule
Emp. Form.:
C19H19F2N3O5S
Mol. Mass.:
439.433
SMILES:
C[C@@](C[C@H]1CC(=NO1)c1ccc(cc1F)-c1ccncc1F)(C(=O)NO)S(C)(=O)=O
: