Target
Tyrosine-protein phosphatase YopH
Ligand
BDBM42151
Substrate
Meas. Tech.
YopH - IC50 determinations (10 point dose range)
IC50
47158.77533±n/a nM
Citation
 PubChem, PC YopH - IC50 determinations (10 point dose range) PubChem Bioassay (2008)[AID] 
Target
Name:
Tyrosine-protein phosphatase YopH
Synonyms:
YOPH_YEREN yopH
Type:
PROTEIN
Mol. Mass.:
50951.99
Organism:
Yersinia enterocolitica
Description:
ChEMBL_965525
Residue:
468
  
Inhibitor
Name:
BDBM42151
Synonyms:
(5aR,9aS)-10-oxidanidyl-5-oxidanylidene-5a,6,7,8,9,9a-hexahydroindeno[1,2-b]quinoxalin-5-ium-11-one (5aR,9aS)-5-keto-10-oxido-5a,6,7,8,9,9a-hexahydroindeno[1,2-b]quinoxalin-5-ium-11-one MLS000089701 cid_1886595
Type:
Small organic molecule
Emp. Form.:
C15H14N2O3
Mol. Mass.:
270.2833
SMILES:
[O-]N1[C@H]2CCCC[C@H]2[N+](=O)C2=C1C(=O)c1ccccc21
: