Target
Tyrosine-protein phosphatase YopH
Ligand
BDBM42207
Substrate
Meas. Tech.
YopH - IC50 determinations (10 point dose range)
IC50
>50000±n/a nM
Citation
 PubChem, PC YopH - IC50 determinations (10 point dose range) PubChem Bioassay (2008)[AID] 
Target
Name:
Tyrosine-protein phosphatase YopH
Synonyms:
YOPH_YEREN yopH
Type:
PROTEIN
Mol. Mass.:
50951.99
Organism:
Yersinia enterocolitica
Description:
ChEMBL_965525
Residue:
468
  
Inhibitor
Name:
BDBM42207
Synonyms:
(8S,8aR,11aS,11bS)-8-Acetyl-10-(4-methoxy-phenyl)-8,8a,11a,11b-tetrahydro-pyrrolo[3',4':3,4]pyrrolo[ 2,1-a]isoquinoline-9,11-dione SMR000146498 | cid_6356140
Type:
Small organic molecule
Emp. Form.:
C23H20N2O4
Mol. Mass.:
388.4159
SMILES:
[H][C@]12[C@H](N3C=Cc4ccccc4[C@]3([H])[C@@]1([H])C(=O)N(C2=O)c1ccc(OC)cc1)C(C)=O
: