Target
Tyrosine-protein phosphatase YopH
Ligand
BDBM42226
Substrate
Meas. Tech.
YopH - IC50 determinations (10 point dose range)
IC50
25873.78693±n/a nM
Citation
 PubChem, PC YopH - IC50 determinations (10 point dose range) PubChem Bioassay (2008)[AID] 
Target
Name:
Tyrosine-protein phosphatase YopH
Synonyms:
YOPH_YEREN yopH
Type:
PROTEIN
Mol. Mass.:
50951.99
Organism:
Yersinia enterocolitica
Description:
ChEMBL_965525
Residue:
468
  
Inhibitor
Name:
BDBM42226
Synonyms:
3-(1H-perimidin-2-yl)aniline SMR000187085 cid_621146
Type:
Small organic molecule
Emp. Form.:
C17H13N3
Mol. Mass.:
259.3052
SMILES:
Nc1cccc(c1)-c1nc2cccc3cccc([nH]1)c23
: