Target
Lysosomal acid glucosylceramidase
Ligand
BDBM42296
Substrate
Meas. Tech.
Dose response cell-based high throughput screening assay to identify enhancers of beta-glucosidase activity
EC50
>50000±n/a nM
Citation
 PubChem, PC Dose response cell-based high throughput screening assay to identify enhancers of beta-glucosidase activity PubChem Bioassay (2008)[AID] 
Target
Name:
Lysosomal acid glucosylceramidase
Synonyms:
Acid beta-glucosidase Beta-glucocerebrosidase D-glucosyl-N-acylsphingosine glucohydrolase GBA1 GC GLUC Glucosylceramidase (GBA) Glucosylceramidase precursor (Beta-glucocerebrosidase) (Acid beta-glucosidase) (D-glucosyl-N-acylsphingosine glucohydrolase) (Alglucerase) (Imiglucerase) beta-glucocerebrosidase (GCase)
Type:
Enzyme
Mol. Mass.:
59724.64
Organism:
Homo sapiens (Human)
Description:
The beta-Glu activity was measured with commercially available beta-glucocerebrosidase (Ceredase) as the enzyme source.
Residue:
536
  
Inhibitor
Name:
BDBM42296
Synonyms:
2-N-butyl-1-N-(3-methoxyphenyl)pyrrolidine-1,2-dicarboxamide N'-butyl-N-(3-methoxyphenyl)pyrrolidine-1,2-dicarboxamide Pyrrolidine-1,2-dicarboxylic acid 2-butylamide 1-[(3-methoxy-phenyl)-amide] cid_656350
Type:
Small organic molecule
Emp. Form.:
C17H25N3O3
Mol. Mass.:
319.3987
SMILES:
CCCCNC(=O)C1CCCN1C(=O)Nc1cccc(OC)c1
: