Target
Lysosomal acid glucosylceramidase
Ligand
BDBM38084
Substrate
Meas. Tech.
Dose response cell-based high throughput screening assay to identify enhancers of beta-glucosidase activity
EC50
>50000±n/a nM
Citation
 PubChem, PC Dose response cell-based high throughput screening assay to identify enhancers of beta-glucosidase activity PubChem Bioassay (2008)[AID] 
Target
Name:
Lysosomal acid glucosylceramidase
Synonyms:
Acid beta-glucosidase Beta-glucocerebrosidase D-glucosyl-N-acylsphingosine glucohydrolase GBA1 GC GLUC Glucosylceramidase (GBA) Glucosylceramidase precursor (Beta-glucocerebrosidase) (Acid beta-glucosidase) (D-glucosyl-N-acylsphingosine glucohydrolase) (Alglucerase) (Imiglucerase) beta-glucocerebrosidase (GCase)
Type:
Enzyme
Mol. Mass.:
59724.64
Organism:
Homo sapiens (Human)
Description:
The beta-Glu activity was measured with commercially available beta-glucocerebrosidase (Ceredase) as the enzyme source.
Residue:
536
  
Inhibitor
Name:
BDBM38084
Synonyms:
MLS000089904 N,N-dimethyl-4-(1-methylbenzimidazol-2-yl)aniline SMR000024522 dimethyl-[4-(1-methylbenzimidazol-2-yl)phenyl]amine
Type:
Small organic molecule
Emp. Form.:
C16H17N3
Mol. Mass.:
251.3263
SMILES:
CN(C)c1ccc(cc1)-c1nc2ccccc2n1C
: