Target
Lysosomal acid glucosylceramidase
Ligand
BDBM42320
Substrate
Meas. Tech.
Dose response cell-based high throughput screening assay to identify enhancers of beta-glucosidase activity
EC50
>10000±n/a nM
Citation
 PubChem, PC Dose response cell-based high throughput screening assay to identify enhancers of beta-glucosidase activity PubChem Bioassay (2008)[AID] 
Target
Name:
Lysosomal acid glucosylceramidase
Synonyms:
Acid beta-glucosidase Beta-glucocerebrosidase D-glucosyl-N-acylsphingosine glucohydrolase GBA1 GC GLUC Glucosylceramidase (GBA) Glucosylceramidase precursor (Beta-glucocerebrosidase) (Acid beta-glucosidase) (D-glucosyl-N-acylsphingosine glucohydrolase) (Alglucerase) (Imiglucerase) beta-glucocerebrosidase (GCase)
Type:
Enzyme
Mol. Mass.:
59724.64
Organism:
Homo sapiens (Human)
Description:
The beta-Glu activity was measured with commercially available beta-glucocerebrosidase (Ceredase) as the enzyme source.
Residue:
536
  
Inhibitor
Name:
BDBM42320
Synonyms:
MLS000090517 N-(2-ethoxybenzyl)-2-oxo-2,3-dihydro-1,3-benzothiazole-6-sulfonamide N-[(2-ethoxyphenyl)methyl]-2-oxo-3H-1,3-benzothiazole-6-sulfonamide cid_3236973
Type:
Small organic molecule
Emp. Form.:
C16H16N2O4S2
Mol. Mass.:
364.439
SMILES:
CCOc1ccccc1CNS(=O)(=O)c1ccc2[nH]c(=O)sc2c1
: