Target
Lysosomal acid glucosylceramidase
Ligand
BDBM42358
Substrate
Meas. Tech.
Dose response cell-based high throughput screening assay to identify enhancers of beta-glucosidase activity
EC50
>10000±n/a nM
Citation
 PubChem, PC Dose response cell-based high throughput screening assay to identify enhancers of beta-glucosidase activity PubChem Bioassay (2008)[AID] 
Target
Name:
Lysosomal acid glucosylceramidase
Synonyms:
Acid beta-glucosidase Beta-glucocerebrosidase D-glucosyl-N-acylsphingosine glucohydrolase GBA1 GC GLUC Glucosylceramidase (GBA) Glucosylceramidase precursor (Beta-glucocerebrosidase) (Acid beta-glucosidase) (D-glucosyl-N-acylsphingosine glucohydrolase) (Alglucerase) (Imiglucerase) beta-glucocerebrosidase (GCase)
Type:
Enzyme
Mol. Mass.:
59724.64
Organism:
Homo sapiens (Human)
Description:
The beta-Glu activity was measured with commercially available beta-glucocerebrosidase (Ceredase) as the enzyme source.
Residue:
536
  
Inhibitor
Name:
BDBM42358
Synonyms:
4-methyl-N-[2-methyl-1-(3-morpholinopropylcarbamoyl)propyl]cyclohexanecarboxamide 4-methyl-N-[3-methyl-1-(3-morpholin-4-ylpropylamino)-1-oxobutan-2-yl]cyclohexane-1-carboxamide MLS000095025 cid_3243058
Type:
Small organic molecule
Emp. Form.:
C20H37N3O3
Mol. Mass.:
367.5261
SMILES:
CC(C)C(NC(=O)C1CCC(C)CC1)C(=O)NCCCN1CCOCC1
: