Target
Lysosomal acid glucosylceramidase
Ligand
BDBM42389
Substrate
Meas. Tech.
Dose response cell-based high throughput screening assay to identify enhancers of beta-glucosidase activity
EC50
>10000±n/a nM
Citation
 PubChem, PC Dose response cell-based high throughput screening assay to identify enhancers of beta-glucosidase activity PubChem Bioassay (2008)[AID] 
Target
Name:
Lysosomal acid glucosylceramidase
Synonyms:
Acid beta-glucosidase Beta-glucocerebrosidase D-glucosyl-N-acylsphingosine glucohydrolase GBA1 GC GLUC Glucosylceramidase (GBA) Glucosylceramidase precursor (Beta-glucocerebrosidase) (Acid beta-glucosidase) (D-glucosyl-N-acylsphingosine glucohydrolase) (Alglucerase) (Imiglucerase) beta-glucocerebrosidase (GCase)
Type:
Enzyme
Mol. Mass.:
59724.64
Organism:
Homo sapiens (Human)
Description:
The beta-Glu activity was measured with commercially available beta-glucocerebrosidase (Ceredase) as the enzyme source.
Residue:
536
  
Inhibitor
Name:
BDBM42389
Synonyms:
6'-amino-1'-(3-chlorophenyl)-5'-cyano-3'-methyl-1-spiro[piperidine-4,4'-pyrano[2,3-c]pyrazole]carboxylic acid ethyl ester MLS000050713 cid_2962025 ethyl 6'-amino-1'-(3-chlorophenyl)-5'-cyano-3'-methylspiro[piperidine-4,4'-pyrano[2,3-c]pyrazole]-1-carboxylate | ethyl 6'-azanyl-1'-(3-chlorophenyl)-5'-cyano-3'-methyl-spiro[piperidine-4,4'-pyrano[2,3-c]pyrazole]-1-carboxylate
Type:
Small organic molecule
Emp. Form.:
C21H22ClN5O3
Mol. Mass.:
427.884
SMILES:
CCOC(=O)N1CCC2(CC1)C(C#N)C(=N)Oc1c2c(C)nn1-c1cccc(Cl)c1
: