Target
Lysosomal acid glucosylceramidase
Ligand
BDBM42398
Substrate
Meas. Tech.
Dose response cell-based high throughput screening assay to identify enhancers of beta-glucosidase activity
EC50
>50000±n/a nM
Citation
 PubChem, PC Dose response cell-based high throughput screening assay to identify enhancers of beta-glucosidase activity PubChem Bioassay (2008)[AID] 
Target
Name:
Lysosomal acid glucosylceramidase
Synonyms:
Acid beta-glucosidase Beta-glucocerebrosidase D-glucosyl-N-acylsphingosine glucohydrolase GBA1 GC GLUC Glucosylceramidase (GBA) Glucosylceramidase precursor (Beta-glucocerebrosidase) (Acid beta-glucosidase) (D-glucosyl-N-acylsphingosine glucohydrolase) (Alglucerase) (Imiglucerase) beta-glucocerebrosidase (GCase)
Type:
Enzyme
Mol. Mass.:
59724.64
Organism:
Homo sapiens (Human)
Description:
The beta-Glu activity was measured with commercially available beta-glucocerebrosidase (Ceredase) as the enzyme source.
Residue:
536
  
Inhibitor
Name:
BDBM42398
Synonyms:
1-(3-besylimidazolidin-1-yl)-2-morpholino-ethanone 1-[3-(benzenesulfonyl)imidazolidin-1-yl]-2-morpholin-4-ylethanone 4-{2-oxo-2-[3-(phenylsulfonyl)-1-imidazolidinyl]ethyl}morpholine SMR000072764 | cid_747981
Type:
Small organic molecule
Emp. Form.:
C15H21N3O4S
Mol. Mass.:
339.41
SMILES:
O=C(CN1CCOCC1)N1CCN(C1)S(=O)(=O)c1ccccc1
: