Target
Neuropeptide Y receptor type 1
Ligand
BDBM38893
Substrate
Meas. Tech.
Dose response cell-based screening assay for antagonists of neuropeptide Y receptor Y1 (NPY-Y1)
IC50
>35000±n/a nM
Citation
 PubChem, PC Dose response cell-based screening assay for antagonists of neuropeptide Y receptor Y1 (NPY-Y1) PubChem Bioassay (2008)[AID] 
Target
Name:
Neuropeptide Y receptor type 1
Synonyms:
NPY-Y1 NPY1R NPYR neuropeptide Y receptor Y1
Type:
Enzyme Catalytic Domain
Mol. Mass.:
44399.07
Organism:
Homo sapiens (Human)
Description:
NPY-Y1 NPY1R HUMAN::P25929
Residue:
384
  
Inhibitor
Name:
BDBM38893
Synonyms:
1-(1,1,1,3,3,3-hexafluoro-2-methylpropan-2-yl)-3-[5-(trifluoromethyl)-1,3,4-thiadiazol-2-yl]urea 1-[5-(trifluoromethyl)-1,3,4-thiadiazol-2-yl]-3-[2,2,2-trifluoro-1-methyl-1-(trifluoromethyl)ethyl]urea SMR000040645 | cid_659661
Type:
Small organic molecule
Emp. Form.:
C8H5F9N4OS
Mol. Mass.:
376.202
SMILES:
CC(NC(=O)Nc1nnc(s1)C(F)(F)F)(C(F)(F)F)C(F)(F)F
: