Target
Neuropeptide Y receptor type 1
Ligand
BDBM42415
Substrate
Meas. Tech.
Dose response cell-based screening assay for antagonists of neuropeptide Y receptor Y1 (NPY-Y1)
IC50
>35000±n/a nM
Citation
 PubChem, PC Dose response cell-based screening assay for antagonists of neuropeptide Y receptor Y1 (NPY-Y1) PubChem Bioassay (2008)[AID] 
Target
Name:
Neuropeptide Y receptor type 1
Synonyms:
NPY-Y1 NPY1R NPYR neuropeptide Y receptor Y1
Type:
Enzyme Catalytic Domain
Mol. Mass.:
44399.07
Organism:
Homo sapiens (Human)
Description:
NPY-Y1 NPY1R HUMAN::P25929
Residue:
384
  
Inhibitor
Name:
BDBM42415
Synonyms:
2,6-dibutoxy-N-(5-methyl-1,2-oxazol-3-yl)benzamide 2,6-dibutoxy-N-(5-methylisoxazol-3-yl)benzamide SMR000077587 | cid_2214635
Type:
Small organic molecule
Emp. Form.:
C19H26N2O4
Mol. Mass.:
346.4207
SMILES:
CCCCOc1cccc(OCCCC)c1C(=O)Nc1cc(C)on1
: