Target
Neuropeptide Y receptor type 1
Ligand
BDBM42418
Substrate
Meas. Tech.
Dose response cell-based screening assay for antagonists of neuropeptide Y receptor Y1 (NPY-Y1)
IC50
>35000±n/a nM
Citation
 PubChem, PC Dose response cell-based screening assay for antagonists of neuropeptide Y receptor Y1 (NPY-Y1) PubChem Bioassay (2008)[AID] 
Target
Name:
Neuropeptide Y receptor type 1
Synonyms:
NPY-Y1 NPY1R NPYR neuropeptide Y receptor Y1
Type:
Enzyme Catalytic Domain
Mol. Mass.:
44399.07
Organism:
Homo sapiens (Human)
Description:
NPY-Y1 NPY1R HUMAN::P25929
Residue:
384
  
Inhibitor
Name:
BDBM42418
Synonyms:
1-(1-tert-butyl-1,2,3,4-tetrazol-5-yl)-N-(furan-2-ylmethyl)-N-(phenylmethyl)-1-[4-(trifluoromethyl)phenyl]methanamine Benzyl-[(1-tert-butyl-1H-tetrazol-5-yl)-(4-trifluoromethyl-phenyl)-methyl]-furan-2-ylmethyl-amine N-benzyl-1-(1-tert-butyltetrazol-5-yl)-N-(furan-2-ylmethyl)-1-[4-(trifluoromethyl)phenyl]methanamine benzyl-[(1-tert-butyltetrazol-5-yl)-[4-(trifluoromethyl)phenyl]methyl]-(2-furfuryl)amine | cid_3229320
Type:
Small organic molecule
Emp. Form.:
C25H26F3N5O
Mol. Mass.:
469.502
SMILES:
CC(C)(C)n1nnnc1C(N(Cc1ccco1)Cc1ccccc1)c1ccc(cc1)C(F)(F)F
: