Target
Neuropeptide Y receptor type 1
Ligand
BDBM42432
Substrate
Meas. Tech.
Dose response cell-based screening assay for antagonists of neuropeptide Y receptor Y1 (NPY-Y1)
IC50
>35000±n/a nM
Citation
 PubChem, PC Dose response cell-based screening assay for antagonists of neuropeptide Y receptor Y1 (NPY-Y1) PubChem Bioassay (2008)[AID] 
Target
Name:
Neuropeptide Y receptor type 1
Synonyms:
NPY-Y1 NPY1R NPYR neuropeptide Y receptor Y1
Type:
Enzyme Catalytic Domain
Mol. Mass.:
44399.07
Organism:
Homo sapiens (Human)
Description:
NPY-Y1 NPY1R HUMAN::P25929
Residue:
384
  
Inhibitor
Name:
BDBM42432
Synonyms:
MLS000585997 N-(2,6-diethylphenyl)-2-phenyl-2-(thiophen-2-ylsulfonylamino)acetamide N-(2,6-diethylphenyl)-2-phenyl-2-[(thien-2-ylsulfonyl)amino]acetamide cid_12005500
Type:
Small organic molecule
Emp. Form.:
C22H24N2O3S2
Mol. Mass.:
428.568
SMILES:
CCc1cccc(CC)c1NC(=O)C(NS(=O)(=O)c1cccs1)c1ccccc1
: