Target
Neuropeptide Y receptor type 2
Ligand
BDBM38893
Substrate
Meas. Tech.
Dose response counterscreen assay for neuropeptide Y receptor Y1 (NPY-Y1): Cell-based high throughput assay to measure NPY-Y2 antagonism
IC50
>35000±n/a nM
Citation
 PubChem, PC Dose response counterscreen assay for neuropeptide Y receptor Y1 (NPY-Y1): Cell-based high throughput assay to measure NPY-Y2 antagonism PubChem Bioassay (2008)[AID] 
Target
Name:
Neuropeptide Y receptor type 2
Synonyms:
NPY-Y2 NPY2-R NPY2R_HUMAN Y2 receptor | neuropeptide Y receptor Y2
Type:
Enzyme Catalytic Domain
Mol. Mass.:
42734.65
Organism:
Homo sapiens (Human)
Description:
NPY-Y2 NPY2R HUMAN::P49146
Residue:
381
  
Inhibitor
Name:
BDBM38893
Synonyms:
1-(1,1,1,3,3,3-hexafluoro-2-methylpropan-2-yl)-3-[5-(trifluoromethyl)-1,3,4-thiadiazol-2-yl]urea 1-[5-(trifluoromethyl)-1,3,4-thiadiazol-2-yl]-3-[2,2,2-trifluoro-1-methyl-1-(trifluoromethyl)ethyl]urea SMR000040645 | cid_659661
Type:
Small organic molecule
Emp. Form.:
C8H5F9N4OS
Mol. Mass.:
376.202
SMILES:
CC(NC(=O)Nc1nnc(s1)C(F)(F)F)(C(F)(F)F)C(F)(F)F
: