Target
Neuropeptide Y receptor type 2
Ligand
BDBM42445
Substrate
Meas. Tech.
Dose response counterscreen assay for neuropeptide Y receptor Y1 (NPY-Y1): Cell-based high throughput assay to measure NPY-Y2 antagonism
IC50
>35000±n/a nM
Citation
 PubChem, PC Dose response counterscreen assay for neuropeptide Y receptor Y1 (NPY-Y1): Cell-based high throughput assay to measure NPY-Y2 antagonism PubChem Bioassay (2008)[AID] 
Target
Name:
Neuropeptide Y receptor type 2
Synonyms:
NPY-Y2 NPY2-R NPY2R_HUMAN Y2 receptor | neuropeptide Y receptor Y2
Type:
Enzyme Catalytic Domain
Mol. Mass.:
42734.65
Organism:
Homo sapiens (Human)
Description:
NPY-Y2 NPY2R HUMAN::P49146
Residue:
381
  
Inhibitor
Name:
BDBM42445
Synonyms:
5-tert-butyl-N-[2-(cyclopentylamino)-2-keto-ethyl]-N-(2-methoxyphenyl)-3-methyl-2-furamide 5-tert-butyl-N-[2-(cyclopentylamino)-2-oxoethyl]-N-(2-methoxyphenyl)-3-methyl-2-furancarboxamide MLS000764944 cid_1454987
Type:
Small organic molecule
Emp. Form.:
C24H32N2O4
Mol. Mass.:
412.5219
SMILES:
COc1ccccc1N(CC(=O)NC1CCCC1)C(=O)c1oc(cc1C)C(C)(C)C
: