Target
Neuropeptide Y receptor type 2
Ligand
BDBM42461
Substrate
Meas. Tech.
Dose response counterscreen assay for neuropeptide Y receptor Y1 (NPY-Y1): Cell-based high throughput assay to measure NPY-Y2 antagonism
IC50
>35000±n/a nM
Citation
 PubChem, PC Dose response counterscreen assay for neuropeptide Y receptor Y1 (NPY-Y1): Cell-based high throughput assay to measure NPY-Y2 antagonism PubChem Bioassay (2008)[AID] 
Target
Name:
Neuropeptide Y receptor type 2
Synonyms:
NPY-Y2 NPY2-R NPY2R_HUMAN Y2 receptor | neuropeptide Y receptor Y2
Type:
Enzyme Catalytic Domain
Mol. Mass.:
42734.65
Organism:
Homo sapiens (Human)
Description:
NPY-Y2 NPY2R HUMAN::P49146
Residue:
381
  
Inhibitor
Name:
BDBM42461
Synonyms:
3-[(4-methoxyphenyl)-methyl-sulfamoyl]-N-(4-methylcyclohexyl)benzamide MLS000760815 cid_16196679
Type:
Small organic molecule
Emp. Form.:
C22H28N2O4S
Mol. Mass.:
416.534
SMILES:
COc1ccc(cc1)N(C)S(=O)(=O)c1cccc(c1)C(=O)NC1CCC(C)CC1
: