Target
Neuropeptide Y receptor type 1
Ligand
BDBM42494
Substrate
Meas. Tech.
Dose response counterscreen for neuropeptide Y receptor Y2 (NPY-Y2): Cell-based high throughput assay to measure NPY-Y1 antagonism
IC50
4465±n/a nM
Citation
 PubChem, PC Dose response counterscreen for neuropeptide Y receptor Y2 (NPY-Y2): Cell-based high throughput assay to measure NPY-Y1 antagonism PubChem Bioassay (2008)[AID] 
Target
Name:
Neuropeptide Y receptor type 1
Synonyms:
NPY-Y1 NPY1R NPYR neuropeptide Y receptor Y1
Type:
Enzyme Catalytic Domain
Mol. Mass.:
44399.07
Organism:
Homo sapiens (Human)
Description:
NPY-Y1 NPY1R HUMAN::P25929
Residue:
384
  
Inhibitor
Name:
BDBM42494
Synonyms:
5-(2,4-dichlorophenyl)-N-[2-(4-methyl-1-piperazinyl)phenyl]-2-furamide 5-(2,4-dichlorophenyl)-N-[2-(4-methylpiperazin-1-yl)phenyl]furan-2-carboxamide MLS000539241 cid_1249075
Type:
Small organic molecule
Emp. Form.:
C22H21Cl2N3O2
Mol. Mass.:
430.327
SMILES:
CN1CCN(CC1)c1ccccc1NC(=O)c1ccc(o1)-c1ccc(Cl)cc1Cl
: