Target
Neuropeptide Y receptor type 1
Ligand
BDBM42506
Substrate
Meas. Tech.
Dose response counterscreen for neuropeptide Y receptor Y2 (NPY-Y2): Cell-based high throughput assay to measure NPY-Y1 antagonism
IC50
4380±n/a nM
Citation
 PubChem, PC Dose response counterscreen for neuropeptide Y receptor Y2 (NPY-Y2): Cell-based high throughput assay to measure NPY-Y1 antagonism PubChem Bioassay (2008)[AID] 
Target
Name:
Neuropeptide Y receptor type 1
Synonyms:
NPY-Y1 NPY1R NPYR neuropeptide Y receptor Y1
Type:
Enzyme Catalytic Domain
Mol. Mass.:
44399.07
Organism:
Homo sapiens (Human)
Description:
NPY-Y1 NPY1R HUMAN::P25929
Residue:
384
  
Inhibitor
Name:
BDBM42506
Synonyms:
5-(2-morpholin-4-ylethylamino)quinazolino[2,3-a]phthalazin-8-one 5-[2-(4-morpholinyl)ethylamino]-8-quinazolino[2,3-a]phthalazinone SMR000155600 | cid_1186757
Type:
Small organic molecule
Emp. Form.:
C21H21N5O2
Mol. Mass.:
375.4237
SMILES:
O=c1c2ccccc2nc2c3ccccc3c(NCCN3CCOCC3)nn12
: