Target
Neuropeptide Y receptor type 1
Ligand
BDBM42517
Substrate
Meas. Tech.
Dose response counterscreen for neuropeptide Y receptor Y2 (NPY-Y2): Cell-based high throughput assay to measure NPY-Y1 antagonism
IC50
6959±n/a nM
Citation
 PubChem, PC Dose response counterscreen for neuropeptide Y receptor Y2 (NPY-Y2): Cell-based high throughput assay to measure NPY-Y1 antagonism PubChem Bioassay (2008)[AID] 
Target
Name:
Neuropeptide Y receptor type 1
Synonyms:
NPY-Y1 NPY1R NPYR neuropeptide Y receptor Y1
Type:
Enzyme Catalytic Domain
Mol. Mass.:
44399.07
Organism:
Homo sapiens (Human)
Description:
NPY-Y1 NPY1R HUMAN::P25929
Residue:
384
  
Inhibitor
Name:
BDBM42517
Synonyms:
2-[(2-chlorobenzyl)thio]-5-[(E)-styryl]-1,3,4-oxadiazole 2-[(2-chlorophenyl)methylthio]-5-[(E)-2-phenylethenyl]-1,3,4-oxadiazole MLS000546554 cid_5854588
Type:
Small organic molecule
Emp. Form.:
C17H13ClN2OS
Mol. Mass.:
328.816
SMILES:
Clc1ccccc1CSc1nnc(\C=C\c2ccccc2)o1
: