Target
Neuropeptide Y receptor type 1
Ligand
BDBM42542
Substrate
Meas. Tech.
Dose response counterscreen for neuropeptide Y receptor Y2 (NPY-Y2): Cell-based high throughput assay to measure NPY-Y1 antagonism
IC50
8303±n/a nM
Citation
 PubChem, PC Dose response counterscreen for neuropeptide Y receptor Y2 (NPY-Y2): Cell-based high throughput assay to measure NPY-Y1 antagonism PubChem Bioassay (2008)[AID] 
Target
Name:
Neuropeptide Y receptor type 1
Synonyms:
NPY-Y1 NPY1R NPYR neuropeptide Y receptor Y1
Type:
Enzyme Catalytic Domain
Mol. Mass.:
44399.07
Organism:
Homo sapiens (Human)
Description:
NPY-Y1 NPY1R HUMAN::P25929
Residue:
384
  
Inhibitor
Name:
BDBM42542
Synonyms:
(4-Chloro-benzylsulfanyl)-acetic acid (2,6-dichloro-benzylidene)-hydrazide 2-[(4-chlorophenyl)methylsulfanyl]-N-[(2,6-dichlorophenyl)methylideneamino]acetamide MLS000560914 SMR000174266 | cid_3097657
Type:
Small organic molecule
Emp. Form.:
C16H13Cl3N2OS
Mol. Mass.:
387.711
SMILES:
Clc1ccc(CSCC(=O)NN=Cc2c(Cl)cccc2Cl)cc1
: