Target
Neuropeptide Y receptor type 1
Ligand
BDBM42569
Substrate
Meas. Tech.
Dose response counterscreen for neuropeptide Y receptor Y2 (NPY-Y2): Cell-based high throughput assay to measure NPY-Y1 antagonism
IC50
5724±n/a nM
Citation
 PubChem, PC Dose response counterscreen for neuropeptide Y receptor Y2 (NPY-Y2): Cell-based high throughput assay to measure NPY-Y1 antagonism PubChem Bioassay (2008)[AID] 
Target
Name:
Neuropeptide Y receptor type 1
Synonyms:
NPY-Y1 NPY1R NPYR neuropeptide Y receptor Y1
Type:
Enzyme Catalytic Domain
Mol. Mass.:
44399.07
Organism:
Homo sapiens (Human)
Description:
NPY-Y1 NPY1R HUMAN::P25929
Residue:
384
  
Inhibitor
Name:
BDBM42569
Synonyms:
4-phenylbenzoic acid [2-keto-2-(2-phenylanilino)ethyl] ester MLS000375281 [2-oxidanylidene-2-[(2-phenylphenyl)amino]ethyl] 4-phenylbenzoate cid_2450538
Type:
Small organic molecule
Emp. Form.:
C27H21NO3
Mol. Mass.:
407.4605
SMILES:
O=C(COC(=O)c1ccc(cc1)-c1ccccc1)Nc1ccccc1-c1ccccc1
: