Target
Mitogen-activated protein kinase 10
Ligand
BDBM42688
Substrate
Meas. Tech.
Dose response biochemical screening assay for inhibitors of c-Jun N-Terminal Kinase 3 (JNK3)
IC50
7930±n/a nM
Citation
 PubChem, PC Dose response biochemical screening assay for inhibitors of c-Jun N-Terminal Kinase 3 (JNK3) PubChem Bioassay (2008)[AID] 
Target
Name:
Mitogen-activated protein kinase 10
Synonyms:
JNK3 MAP kinase p49 3F12 MK10_HUMAN Mitogen-activated protein kinase 10 (Stress-activated protein kinase JNK3) (c-Jun N-terminal kinase 3) (MAP kinase p49 3F12) PRKM10 Stress-activated protein kinase JNK3 | c-Jun N-terminal kinase 3 (JNK3)
Type:
Enzyme
Mol. Mass.:
52586.89
Organism:
Homo sapiens (Human)
Description:
Residue:
464
  
Inhibitor
Name:
BDBM42688
Synonyms:
2-[2-(5,6-dimethyl-4-oxidanylidene-3-prop-2-enyl-thieno[2,3-d]pyrimidin-2-yl)sulfanylethanoylamino]thiophene-3-carboxamide 2-[[2-[(3-allyl-4-keto-5,6-dimethyl-thieno[2,3-d]pyrimidin-2-yl)thio]acetyl]amino]thiophene-3-carboxamide MLS000058244 cid_2589475
Type:
Small organic molecule
Emp. Form.:
C18H18N4O3S3
Mol. Mass.:
434.556
SMILES:
Cc1sc2nc(SCC(=O)Nc3sccc3C(N)=O)n(CC=C)c(=O)c2c1C
: