Target
Mitogen-activated protein kinase 10
Ligand
BDBM42731
Substrate
Meas. Tech.
Dose response biochemical screening assay for inhibitors of c-Jun N-Terminal Kinase 3 (JNK3)
IC50
3356±n/a nM
Citation
 PubChem, PC Dose response biochemical screening assay for inhibitors of c-Jun N-Terminal Kinase 3 (JNK3) PubChem Bioassay (2008)[AID] 
Target
Name:
Mitogen-activated protein kinase 10
Synonyms:
JNK3 MAP kinase p49 3F12 MK10_HUMAN Mitogen-activated protein kinase 10 (Stress-activated protein kinase JNK3) (c-Jun N-terminal kinase 3) (MAP kinase p49 3F12) PRKM10 Stress-activated protein kinase JNK3 | c-Jun N-terminal kinase 3 (JNK3)
Type:
Enzyme
Mol. Mass.:
52586.89
Organism:
Homo sapiens (Human)
Description:
Residue:
464
  
Inhibitor
Name:
BDBM42731
Synonyms:
(11Z)-11H-indeno[1,2-b]quinoxalin-11-one oxime 5-oxide 5-hydroxy-11-nitroso-indeno[1,2-b]quinoxaline MLS000043066 cid_3242057
Type:
Small organic molecule
Emp. Form.:
C15H9N3O2
Mol. Mass.:
263.2509
SMILES:
On1c2c3ccccc3c(N=O)c2nc2ccccc12
: