Target
Mitogen-activated protein kinase 10
Ligand
BDBM42813
Substrate
Meas. Tech.
Dose response biochemical screening assay for inhibitors of c-Jun N-Terminal Kinase 3 (JNK3)
IC50
3259±n/a nM
Citation
 PubChem, PC Dose response biochemical screening assay for inhibitors of c-Jun N-Terminal Kinase 3 (JNK3) PubChem Bioassay (2008)[AID] 
Target
Name:
Mitogen-activated protein kinase 10
Synonyms:
JNK3 MAP kinase p49 3F12 MK10_HUMAN Mitogen-activated protein kinase 10 (Stress-activated protein kinase JNK3) (c-Jun N-terminal kinase 3) (MAP kinase p49 3F12) PRKM10 Stress-activated protein kinase JNK3 | c-Jun N-terminal kinase 3 (JNK3)
Type:
Enzyme
Mol. Mass.:
52586.89
Organism:
Homo sapiens (Human)
Description:
Residue:
464
  
Inhibitor
Name:
BDBM42813
Synonyms:
4-[4-[(4-keto-2-thioxo-1H-quinazolin-3-yl)methyl]cyclohexanecarbonyl]piperazine-1-carboxylic acid ethyl ester MLS000049602 cid_2952870 ethyl 4-[4-[(4-oxidanylidene-2-sulfanylidene-1H-quinazolin-3-yl)methyl]cyclohexyl]carbonylpiperazine-1-carboxylate | ethyl 4-[4-[(4-oxo-2-sulfanylidene-1H-quinazolin-3-yl)methyl]cyclohexanecarbonyl]piperazine-1-carboxylate
Type:
Small organic molecule
Emp. Form.:
C23H30N4O4S
Mol. Mass.:
458.574
SMILES:
CCOC(=O)N1CCN(CC1)C(=O)C1CCC(Cn2c(=S)[nH]c3ccccc3c2=O)CC1
: