Target
Nuclear receptor coactivator 1
Ligand
BDBM37375
Substrate
Meas. Tech.
Dose response biochemical High Throughput Screening assay for agonists of the steroid receptor coactivator 1 (SRC-1) recruitment by the peroxisome proliferator-activated receptor gamma (PPARgamma)
EC50
>79370±n/a nM
Citation
 PubChem, PC Dose response biochemical High Throughput Screening assay for agonists of the steroid receptor coactivator 1 (SRC-1) recruitment by the peroxisome proliferator-activated receptor gamma (PPARgamma) PubChem Bioassay (2008)[AID] 
Target
Name:
Nuclear receptor coactivator 1
Synonyms:
BHLHE74 NCOA1 NCoA-1 Protein Hin-2 Renal carcinoma antigen NY-REN-52 SRC1 nuclear receptor coactivator 1 isoform 1
Type:
PROTEIN
Mol. Mass.:
156749.34
Organism:
Homo sapiens (Human)
Description:
ChEMBL_759690
Residue:
1441
  
Inhibitor
Name:
BDBM37375
Synonyms:
2-[(4-amino-7-methyl-5,6,7,8-tetrahydro-[1]benzothiolo[2,3-d]pyrimidin-2-yl)sulfanyl]-N-(furan-2-ylmethyl)acetamide 2-[(4-amino-7-methyl-5,6,7,8-tetrahydrobenzothiopheno[2,3-d]pyrimidin-2-yl)thio]-N-(2-furfuryl)acetamide MLS000078256 cid_660429
Type:
Small organic molecule
Emp. Form.:
C18H20N4O2S2
Mol. Mass.:
388.507
SMILES:
CC1CCc2c(C1)sc1nc(SCC(=O)NCc3ccco3)nc(N)c21
: