Target
Nuclear receptor coactivator 1
Ligand
BDBM42907
Substrate
Meas. Tech.
Dose response biochemical High Throughput Screening assay for agonists of the steroid receptor coactivator 1 (SRC-1) recruitment by the peroxisome proliferator-activated receptor gamma (PPARgamma)
EC50
>79370±n/a nM
Citation
 PubChem, PC Dose response biochemical High Throughput Screening assay for agonists of the steroid receptor coactivator 1 (SRC-1) recruitment by the peroxisome proliferator-activated receptor gamma (PPARgamma) PubChem Bioassay (2008)[AID] 
Target
Name:
Nuclear receptor coactivator 1
Synonyms:
BHLHE74 NCOA1 NCoA-1 Protein Hin-2 Renal carcinoma antigen NY-REN-52 SRC1 nuclear receptor coactivator 1 isoform 1
Type:
PROTEIN
Mol. Mass.:
156749.34
Organism:
Homo sapiens (Human)
Description:
ChEMBL_759690
Residue:
1441
  
Inhibitor
Name:
BDBM42907
Synonyms:
2-(4-methyl-1,3-thiazol-2-yl)-3-oxidanylidene-3-pyridin-4-yl-propanenitrile 2-(4-methyl-2-thiazolyl)-3-oxo-3-pyridin-4-ylpropanenitrile MLS000039937 cid_664967
Type:
Small organic molecule
Emp. Form.:
C12H9N3OS
Mol. Mass.:
243.284
SMILES:
Cc1csc(n1)C(C#N)C(=O)c1ccncc1
: