Target
Nuclear receptor coactivator 1
Ligand
BDBM40284
Substrate
Meas. Tech.
Dose response biochemical High Throughput Screening assay for agonists of the steroid receptor coactivator 1 (SRC-1) recruitment by the peroxisome proliferator-activated receptor gamma (PPARgamma)
EC50
>79370±n/a nM
Citation
 PubChem, PC Dose response biochemical High Throughput Screening assay for agonists of the steroid receptor coactivator 1 (SRC-1) recruitment by the peroxisome proliferator-activated receptor gamma (PPARgamma) PubChem Bioassay (2008)[AID] 
Target
Name:
Nuclear receptor coactivator 1
Synonyms:
BHLHE74 NCOA1 NCoA-1 Protein Hin-2 Renal carcinoma antigen NY-REN-52 SRC1 nuclear receptor coactivator 1 isoform 1
Type:
PROTEIN
Mol. Mass.:
156749.34
Organism:
Homo sapiens (Human)
Description:
ChEMBL_759690
Residue:
1441
  
Inhibitor
Name:
BDBM40284
Synonyms:
MLS000082661 N-(2,3-dihydro-1,4-benzodioxin-6-yl)-2-[(2-ethyl-[1]benzofuro[3,2-d]pyrimidin-4-yl)sulfanyl]acetamide N-(2,3-dihydro-1,4-benzodioxin-6-yl)-2-[(2-ethylbenzofuro[3,2-d]pyrimidin-4-yl)thio]acetamide cid_665236
Type:
Small organic molecule
Emp. Form.:
C22H19N3O4S
Mol. Mass.:
421.469
SMILES:
CCc1nc(SCC(=O)Nc2ccc3OCCOc3c2)c2oc3ccccc3c2n1
: