Target
Nuclear receptor coactivator 1
Ligand
BDBM42991
Substrate
Meas. Tech.
Dose response biochemical High Throughput Screening assay for agonists of the steroid receptor coactivator 1 (SRC-1) recruitment by the peroxisome proliferator-activated receptor gamma (PPARgamma)
EC50
10040±n/a nM
Citation
 PubChem, PC Dose response biochemical High Throughput Screening assay for agonists of the steroid receptor coactivator 1 (SRC-1) recruitment by the peroxisome proliferator-activated receptor gamma (PPARgamma) PubChem Bioassay (2008)[AID] 
Target
Name:
Nuclear receptor coactivator 1
Synonyms:
BHLHE74 NCOA1 NCoA-1 Protein Hin-2 Renal carcinoma antigen NY-REN-52 SRC1 nuclear receptor coactivator 1 isoform 1
Type:
PROTEIN
Mol. Mass.:
156749.34
Organism:
Homo sapiens (Human)
Description:
ChEMBL_759690
Residue:
1441
  
Inhibitor
Name:
BDBM42991
Synonyms:
2-[2-(2-chlorophenyl)-4-phenyl-1,3-thiazol-5-yl]-N-phenyl-ethanamide 2-[2-(2-chlorophenyl)-4-phenyl-5-thiazolyl]-N-phenylacetamide MLS000540239 cid_4329755
Type:
Small organic molecule
Emp. Form.:
C23H17ClN2OS
Mol. Mass.:
404.912
SMILES:
Clc1ccccc1-c1nc(c(CC(=O)Nc2ccccc2)s1)-c1ccccc1
: