Target
Apoptosis regulator Bcl-2
Ligand
BDBM33038
Substrate
Meas. Tech.
Multiplexed high-throughput screen for small molecule regulators of Bcl-2 family protein interactions, specifically Bim-Bcl-2
EC50
11380±n/a nM
Citation
 PubChem, PC Multiplexed high-throughput screen for small molecule regulators of Bcl-2 family protein interactions, specifically Bim-Bcl-2 PubChem Bioassay (2008)[AID] 
Target
Name:
Apoptosis regulator Bcl-2
Synonyms:
Apoptosis regulator Bcl-2 Protein BCL-2 BCL2_HUMAN | Bcl-2 Protein
Type:
Homodimer or heterodimer
Mol. Mass.:
26269.11
Organism:
Homo sapiens (Human)
Description:
P10415
Residue:
239
  
Inhibitor
Name:
BDBM33038
Synonyms:
Acetic acid 4-(2,3-dihydro-1H-perimidin-2-yl)-2-methoxy-phenyl ester SMR000010695 [4-(2,3-dihydro-1H-perimidin-2-yl)-2-methoxyphenyl] acetate acetic acid [4-(2,3-dihydro-1H-perimidin-2-yl)-2-methoxyphenyl] ester | cid_655850
Type:
Small organic molecule
Emp. Form.:
C20H18N2O3
Mol. Mass.:
334.3685
SMILES:
COc1cc(ccc1OC(C)=O)C1Nc2cccc3cccc(N1)c23
: