Target
Apoptosis regulator Bcl-2
Ligand
BDBM32035
Substrate
Meas. Tech.
Multiplexed high-throughput screen for small molecule regulators of Bcl-2 family protein interactions, specifically Bim-Bcl-2
EC50
37830±n/a nM
Citation
 PubChem, PC Multiplexed high-throughput screen for small molecule regulators of Bcl-2 family protein interactions, specifically Bim-Bcl-2 PubChem Bioassay (2008)[AID] 
Target
Name:
Apoptosis regulator Bcl-2
Synonyms:
Apoptosis regulator Bcl-2 Protein BCL-2 BCL2_HUMAN | Bcl-2 Protein
Type:
Homodimer or heterodimer
Mol. Mass.:
26269.11
Organism:
Homo sapiens (Human)
Description:
P10415
Residue:
239
  
Inhibitor
Name:
BDBM32035
Synonyms:
MLS000080234 cid_659413
Type:
Small organic molecule
Emp. Form.:
C19H12N2O3
Mol. Mass.:
316.3102
SMILES:
O=C1c2ccccc2-c2onc3ccc(NCc4ccco4)c1c23
: