Target
Apoptosis regulator Bcl-2
Ligand
BDBM33069
Substrate
Meas. Tech.
Multiplexed high-throughput screen for small molecule regulators of Bcl-2 family protein interactions, specifically Bim-Bcl-2
EC50
8970±n/a nM
Citation
 PubChem, PC Multiplexed high-throughput screen for small molecule regulators of Bcl-2 family protein interactions, specifically Bim-Bcl-2 PubChem Bioassay (2008)[AID] 
Target
Name:
Apoptosis regulator Bcl-2
Synonyms:
Apoptosis regulator Bcl-2 Protein BCL-2 BCL2_HUMAN | Bcl-2 Protein
Type:
Homodimer or heterodimer
Mol. Mass.:
26269.11
Organism:
Homo sapiens (Human)
Description:
P10415
Residue:
239
  
Inhibitor
Name:
BDBM33069
Synonyms:
4-bromanyl-2-[(E)-3-(2,5-dimethoxyphenyl)prop-2-enoyl]-7-(methylamino)cyclohepta-2,4,6-trien-1-one 4-bromo-2-[(E)-3-(2,5-dimethoxyphenyl)acryloyl]-7-(methylamino)cyclohepta-2,4,6-trien-1-one 4-bromo-2-[3-(2,5-dimethoxyphenyl)acryloyl]-7-(methylamino)-2,4,6-cycloheptatrien-1-one SMR000115626 | cid_7314627
Type:
Small organic molecule
Emp. Form.:
C19H18BrNO4
Mol. Mass.:
404.255
SMILES:
CNc1ccc(Br)cc(C(=O)\C=C\c2cc(OC)ccc2OC)c1=O
: