Target
Apoptosis regulator Bcl-2
Ligand
BDBM33083
Substrate
Meas. Tech.
Multiplexed high-throughput screen for small molecule regulators of Bcl-2 family protein interactions, specifically Bim-Bcl-2
EC50
13600±n/a nM
Citation
 PubChem, PC Multiplexed high-throughput screen for small molecule regulators of Bcl-2 family protein interactions, specifically Bim-Bcl-2 PubChem Bioassay (2008)[AID] 
Target
Name:
Apoptosis regulator Bcl-2
Synonyms:
Apoptosis regulator Bcl-2 Protein BCL-2 BCL2_HUMAN | Bcl-2 Protein
Type:
Homodimer or heterodimer
Mol. Mass.:
26269.11
Organism:
Homo sapiens (Human)
Description:
P10415
Residue:
239
  
Inhibitor
Name:
BDBM33083
Synonyms:
1,4-diketo-3-p-anisyl-naphthalene-2-carboxylic acid ethyl ester MLS000532053 cid_1068432 ethyl 3-[(4-methoxyphenyl)methyl]-1,4-bis(oxidanylidene)naphthalene-2-carboxylate | ethyl 3-[(4-methoxyphenyl)methyl]-1,4-dioxonaphthalene-2-carboxylate
Type:
Small organic molecule
Emp. Form.:
C21H18O5
Mol. Mass.:
350.3646
SMILES:
CCOC(=O)C1=C(Cc2ccc(OC)cc2)C(=O)c2ccccc2C1=O
: