Target
Apoptosis regulator Bcl-2
Ligand
BDBM32286
Substrate
Meas. Tech.
Multiplexed high-throughput screen for small molecule regulators of Bcl-2 family protein interactions, specifically Bim-Bcl-2
EC50
15170±n/a nM
Citation
 PubChem, PC Multiplexed high-throughput screen for small molecule regulators of Bcl-2 family protein interactions, specifically Bim-Bcl-2 PubChem Bioassay (2008)[AID] 
Target
Name:
Apoptosis regulator Bcl-2
Synonyms:
Apoptosis regulator Bcl-2 Protein BCL-2 BCL2_HUMAN | Bcl-2 Protein
Type:
Homodimer or heterodimer
Mol. Mass.:
26269.11
Organism:
Homo sapiens (Human)
Description:
P10415
Residue:
239
  
Inhibitor
Name:
BDBM32286
Synonyms:
4-(4-carbomethoxyanilino)quinazoline-2-carboxylic acid ethyl ester MLS000519323 cid_1192536 ethyl 4-[(4-methoxycarbonylphenyl)amino]quinazoline-2-carboxylate
Type:
Small organic molecule
Emp. Form.:
C19H17N3O4
Mol. Mass.:
351.356
SMILES:
CCOC(=O)c1nc(Nc2ccc(cc2)C(=O)OC)c2ccccc2n1
: