Target
Apoptosis regulator Bcl-2
Ligand
BDBM32299
Substrate
Meas. Tech.
Multiplexed high-throughput screen for small molecule regulators of Bcl-2 family protein interactions, specifically Bim-Bcl-2
EC50
16060±n/a nM
Citation
 PubChem, PC Multiplexed high-throughput screen for small molecule regulators of Bcl-2 family protein interactions, specifically Bim-Bcl-2 PubChem Bioassay (2008)[AID] 
Target
Name:
Apoptosis regulator Bcl-2
Synonyms:
Apoptosis regulator Bcl-2 Protein BCL-2 BCL2_HUMAN | Bcl-2 Protein
Type:
Homodimer or heterodimer
Mol. Mass.:
26269.11
Organism:
Homo sapiens (Human)
Description:
P10415
Residue:
239
  
Inhibitor
Name:
BDBM32299
Synonyms:
2-[(2Z)-2-[(2E)-2-[[3-(2-hydroxyethyl)-5-methoxy-1,3-benzothiazol-3-ium-2-yl]methylidene]butylidene]-5-methoxy-1,3-benzothiazol-3-yl]ethanol;chloride 3-(2-Hydroxy-ethyl)-2-{2-[3-(2-hydroxy-ethyl)-5-methoxy-3H-benzothiazol-2-ylidenemethyl]-but-1-enyl}-5-methoxy-benzothiazol-3-ium Cyanines, 2 SMR000175124 | cid_12004742
Type:
Small organic molecule
Emp. Form.:
C25H29N2O4S2
Mol. Mass.:
485.638
SMILES:
CC\C(=C/c1sc2ccc(OC)cc2[n+]1CCO)\C=C1/Sc2ccc(OC)cc2N1CCO
: